Target
Metabotropic glutamate receptor 5
Ligand
BDBM50293654
Substrate
Meas. Tech.
ChEMBL_571445 (CHEMBL1032756)
EC50
990±n/a nM
Citation
 Ritzén, ASindet, RHentzer, MSvendsen, NBrodbeck, RMBundgaard, C Discovery of a potent and brain penetrant mGluR5 positive allosteric modulator. Bioorg Med Chem Lett 19:3275-8 (2009)  
Target
Name:
Metabotropic glutamate receptor 5
Synonyms:
GPRC1E GRM5_HUMAN metabotropic glutamate 5 | metabotropic glutamate 5a
Type:
Enzyme
Mol. Mass.:
132484.72
Organism:
Homo sapiens (Human)
Description:
Residue:
1212
  
Inhibitor
Name:
BDBM50293654
Synonyms:
CHEMBL570541 | morpholino(6-(2-phenylethynyl)pyridin-3-yl)methanone
Type:
Small organic molecule
Emp. Form.:
C18H16N2O2
Mol. Mass.:
292.3318
SMILES:
O=C(N1CCOCC1)c1ccc(nc1)C#Cc1ccccc1
: