Target
Aurora kinase B
Ligand
BDBM50293680
Substrate
Meas. Tech.
ChEMBL_571640 (CHEMBL1031295)
Ki
>1100±n/a nM
Citation
 Bebbington, DBinch, HCharrier, JDEveritt, SFraysse, DGolec, JKay, DKnegtel, RMak, CMazzei, FMiller, AMortimore, MO'Donnell, MPatel, SPierard, FPinder, JPollard, JRamaya, SRobinson, DRutherford, AStudley, JWestcott, J The discovery of the potent aurora inhibitor MK-0457 (VX-680). Bioorg Med Chem Lett 19:3586-92 (2009)  
Target
Name:
Aurora kinase B
Synonyms:
AIK2 AIM1 ARK2 AURKB_HUMAN Aurora B-INCENP Aurora kinase B (AURKB) STK-1 STK12 Serine/threonine-protein kinase aurora B
Type:
Protein
Mol. Mass.:
39327.72
Organism:
Homo sapiens (Human)
Description:
Q96GD4
Residue:
344
  
Inhibitor
Name:
BDBM50293680
Synonyms:
2-(2,4-dichlorophenylthio)-N-(5-methyl-1H-pyrazol-3-yl)quinazolin-4-amine | CHEMBL551633
Type:
Small organic molecule
Emp. Form.:
C18H13Cl2N5S
Mol. Mass.:
402.3
SMILES:
Cc1cc(Nc2nc(Sc3ccc(Cl)cc3Cl)nc3ccccc23)[nH]n1
: