Target
Aurora kinase A
Ligand
BDBM50293685
Substrate
Meas. Tech.
ChEMBL_571639 (CHEMBL1031294)
Ki
17±n/a nM
Citation
 Bebbington, DBinch, HCharrier, JDEveritt, SFraysse, DGolec, JKay, DKnegtel, RMak, CMazzei, FMiller, AMortimore, MO'Donnell, MPatel, SPierard, FPinder, JPollard, JRamaya, SRobinson, DRutherford, AStudley, JWestcott, J The discovery of the potent aurora inhibitor MK-0457 (VX-680). Bioorg Med Chem Lett 19:3586-92 (2009)  
Target
Name:
Aurora kinase A
Synonyms:
AIK ARK1 AURKA AYK1 Aurora kinase A (AURA) Aurora kinase A (Aurora A) Aurora-related kinase 1 BTAK Breast-tumor-amplified kinase STK15 Serine/threonine kinase 15 Serine/threonine-protein kinase aurora A hARK1
Type:
Serine/threonine-protein kinase
Mol. Mass.:
45830.98
Organism:
Homo sapiens (Human)
Description:
O14965
Residue:
403
  
Inhibitor
Name:
BDBM50293685
Synonyms:
2-(3,4-dimethoxyphenylthio)-N-(5-methyl-1H-pyrazol-3-yl)quinazolin-4-amine | CHEMBL564290
Type:
Small organic molecule
Emp. Form.:
C20H19N5O2S
Mol. Mass.:
393.462
SMILES:
COc1ccc(Sc2nc(Nc3cc(C)n[nH]3)c3ccccc3n2)cc1OC
: