Target
Aurora kinase A
Ligand
BDBM50293687
Substrate
Meas. Tech.
ChEMBL_571639 (CHEMBL1031294)
Ki
2±n/a nM
Citation
 Bebbington, DBinch, HCharrier, JDEveritt, SFraysse, DGolec, JKay, DKnegtel, RMak, CMazzei, FMiller, AMortimore, MO'Donnell, MPatel, SPierard, FPinder, JPollard, JRamaya, SRobinson, DRutherford, AStudley, JWestcott, J The discovery of the potent aurora inhibitor MK-0457 (VX-680). Bioorg Med Chem Lett 19:3586-92 (2009)  
Target
Name:
Aurora kinase A
Synonyms:
AIK ARK1 AURKA AYK1 Aurora kinase A (AURA) Aurora kinase A (Aurora A) Aurora-related kinase 1 BTAK Breast-tumor-amplified kinase STK15 Serine/threonine kinase 15 Serine/threonine-protein kinase aurora A hARK1
Type:
Serine/threonine-protein kinase
Mol. Mass.:
45830.98
Organism:
Homo sapiens (Human)
Description:
O14965
Residue:
403
  
Inhibitor
Name:
BDBM50293687
Synonyms:
CHEMBL552033 | N-(4-(4-(5-methyl-1H-pyrazol-3-ylamino)quinazolin-2-ylthio)phenyl)methanesulfonamide
Type:
Small organic molecule
Emp. Form.:
C19H18N6O2S2
Mol. Mass.:
426.515
SMILES:
Cc1cc(Nc2nc(Sc3ccc(NS(C)(=O)=O)cc3)nc3ccccc23)[nH]n1
: