Target
Proto-oncogene tyrosine-protein kinase Src
Ligand
BDBM50293683
Substrate
Meas. Tech.
ChEMBL_571642 (CHEMBL1031297)
Ki
>1000±n/a nM
Citation
 Bebbington, DBinch, HCharrier, JDEveritt, SFraysse, DGolec, JKay, DKnegtel, RMak, CMazzei, FMiller, AMortimore, MO'Donnell, MPatel, SPierard, FPinder, JPollard, JRamaya, SRobinson, DRutherford, AStudley, JWestcott, J The discovery of the potent aurora inhibitor MK-0457 (VX-680). Bioorg Med Chem Lett 19:3586-92 (2009)  
Target
Name:
Proto-oncogene tyrosine-protein kinase Src
Synonyms:
Calmodulin/Proto-oncogene tyrosine-protein kinase Src Proto-oncogene c-Src SRC SRC_HUMAN V-src sarcoma (Schmidt-Ruppin A-2) viral oncogene homolog (avian) p60-Src | pp60c-src
Type:
Protein
Mol. Mass.:
59838.60
Organism:
Homo sapiens (Human)
Description:
P12931
Residue:
536
  
Inhibitor
Name:
BDBM50293683
Synonyms:
2-(2-methoxyphenylthio)-N-(5-methyl-1H-pyrazol-3-yl)quinazolin-4-amine | CHEMBL551634
Type:
Small organic molecule
Emp. Form.:
C19H17N5OS
Mol. Mass.:
363.436
SMILES:
COc1ccccc1Sc1nc(Nc2cc(C)n[nH]2)c2ccccc2n1
: