Target
Corticotropin-releasing factor receptor 1
Ligand
BDBM50293978
Substrate
Meas. Tech.
ChEMBL_572726 (CHEMBL1030150)
IC50
1.5±n/a nM
Citation
 Hartz, RAAhuja, VTArvanitis, AGRafalski, MYue, EWDenhart, DJSchmitz, WDDitta, JLDeskus, JABrenner, ABHobbs, FWPayne, JLelas, SLi, YWMolski, TFMattson, GKPeng, YWong, HGrace, JELentz, KAQian-Cutrone, JZhuo, XShu, YZLodge, NJZaczek, RCombs, APOlson, REBronson, JJMattson, RJMacor, JE Synthesis, structure-activity relationships, and in vivo evaluation of N3-phenylpyrazinones as novel corticotropin-releasing factor-1 (CRF1) receptor antagonists. J Med Chem 52:4173-91 (2009)  
Target
Name:
Corticotropin-releasing factor receptor 1
Synonyms:
CRF-R CRFR1_RAT Corticotropin releasing factor receptor Corticotropin-releasing Factor Receptor 1 Crhr | Crhr1
Type:
G Protein-Coupled Receptor (GPCR)
Mol. Mass.:
47870.75
Organism:
Rattus norvegicus (rat)
Description:
Receptor binding assays were performed using rat cortex homogenate.
Residue:
415
  
Inhibitor
Name:
BDBM50293978
Synonyms:
(R)-5-Chloro-1-(1-cyclopropylpropyl)-3-[ethyl(2,4,5-trimethylphenyl)amino]pyrazin-2(1H)-one | CHEMBL552559
Type:
Small organic molecule
Emp. Form.:
C21H28ClN3O
Mol. Mass.:
373.92
SMILES:
CC[C@H](C1CC1)n1cc(Cl)nc(N(CC)c2cc(C)c(C)cc2C)c1=O
: