Target
Histamine H3 receptor
Ligand
BDBM50294063
Substrate
Meas. Tech.
ChEMBL_572926 (CHEMBL1036178)
Ki
0.54±n/a nM
Citation
 Zhao, CSun, MBennani, YLMiller, TRWitte, DGEsbenshade, TAWetter, JMarsh, KCHancock, AABrioni, JDCowart, MD Design of a new histamine H3 receptor antagonist chemotype: (3aR,6aR)-5-alkyl-1-aryl-octahydropyrrolo[3,4-b]pyrroles, synthesis, and structure-activity relationships. J Med Chem 52:4640-9 (2009)  
Target
Name:
Histamine H3 receptor
Synonyms:
G-protein coupled receptor 97 HH3R HRH3 Histamine H3 receptor (H3) Histamine receptor (H3 and H4)
Type:
G Protein-Coupled Receptor (GPCR)
Mol. Mass.:
48691.47
Organism:
Homo sapiens (Human)
Description:
Binding assays were using CHO cells stably expressing hH3R receptors.
Residue:
445
  
Inhibitor
Name:
BDBM50294063
Synonyms:
(3aR,6aR)-4'-(5-Methyl-hexahydro-pyrrolo[3,4-b]pyrrol-1-yl)-biphenyl-4-carbonitrile | CHEMBL563998
Type:
Small organic molecule
Emp. Form.:
C20H21N3
Mol. Mass.:
303.4008
SMILES:
CN1C[C@H]2CCN([C@H]2C1)c1ccc(cc1)-c1ccc(cc1)C#N
: