Target
Collagenase 3
Ligand
BDBM50161331
Substrate
Meas. Tech.
ChEMBL_571091 (CHEMBL816917)
IC50
25±n/a nM
Citation
 Nuti, ECasalini, FAvramova, SISantamaria, SCercignani, GMarinelli, LLa Pietra, VNovellino, EOrlandini, ENencetti, STuccinardi, TMartinelli, ALim, NHVisse, RNagase, HRossello, A N-O-isopropyl sulfonamido-based hydroxamates: design, synthesis and biological evaluation of selective matrix metalloproteinase-13 inhibitors as potential therapeutic agents for osteoarthritis. J Med Chem 52:4757-73 (2009)  
Target
Name:
Collagenase 3
Synonyms:
MMP-13 MMP13_HUMAN Matrix metalloproteinase-13 (MMP-13) | Matrix metalloproteinase-13 (MMP13)
Type:
Enzyme
Mol. Mass.:
53808.06
Organism:
Homo sapiens (Human)
Description:
P45452
Residue:
471
  
Inhibitor
Name:
BDBM50161331
Synonyms:
2-[(Biphenyl-4-sulfonyl)-isopropoxy-amino]-N-hydroxy-acetamide N-hydroxy-2-(N-isopropoxybiphenyl-4-ylsulfonamido)acetamide
Type:
Small organic molecule
Emp. Form.:
C17H20N2O5S
Mol. Mass.:
364.416
SMILES:
CC(C)ON(CC(=O)NO)S(=O)(=O)c1ccc(cc1)-c1ccccc1
: