Target
Proto-oncogene Wnt-3
Ligand
BDBM50294824
Substrate
Meas. Tech.
ChEMBL_576549 (CHEMBL1032002)
EC50
2000±n/a nM
Citation
 Lu, JMa, ZHsieh, JCFan, CWChen, BLonggood, JCWilliams, NSAmatruda, JFLum, LChen, C Structure-activity relationship studies of small-molecule inhibitors of Wnt response. Bioorg Med Chem Lett 19:3825-7 (2009)  
Target
Name:
Proto-oncogene Wnt-3
Synonyms:
INT4 WNT3 | WNT3_HUMAN
Type:
PROTEIN
Mol. Mass.:
39653.31
Organism:
Homo sapiens (Human)
Description:
ChEMBL_576549
Residue:
355
  
Inhibitor
Name:
BDBM50294824
Synonyms:
4-((1R,2S,6R,7S)-3,5-Dioxo-4-aza-tricyclo[5.2.1.0*2,6*]dec-8-en-4-yl)-2-methyl-N-quinolin-8-yl-benzamide | CHEMBL556476
Type:
Small organic molecule
Emp. Form.:
C26H21N3O3
Mol. Mass.:
423.4632
SMILES:
Cc1cc(ccc1C(=O)Nc1cccc2cccnc12)-n1c(O)c2[C@H]3C[C@H](C=C3)c2c1O
: