Target
Peroxisome proliferator-activated receptor alpha
Ligand
BDBM50295047
Substrate
Meas. Tech.
ChEMBL_573967 (CHEMBL1062957)
IC50
>15000±n/a nM
Citation
 Gorczynski, MJSmitherman, PKAkiyama, TEWood, HBBerger, JPKing, SBMorrow, CS Activation of peroxisome proliferator-activated receptor gamma (PPARgamma) by nitroalkene fatty acids: importance of nitration position and degree of unsaturation. J Med Chem 52:4631-9 (2009)  
Target
Name:
Peroxisome proliferator-activated receptor alpha
Synonyms:
NR1C1 PPAR PPAR-alpha PPARA_HUMAN Peroxisome proliferator-activated receptor | Peroxisome proliferator-activated receptor alpha (PPAR alpha)
Type:
Enzyme
Mol. Mass.:
52222.08
Organism:
Homo sapiens (Human)
Description:
Q07869
Residue:
468
  
Inhibitor
Name:
BDBM50295047
Synonyms:
(E)-9-Nitrohexadec-9-enoicAcid | CHEMBL560513
Type:
Small organic molecule
Emp. Form.:
C16H29NO4
Mol. Mass.:
299.4058
SMILES:
CCCCCC\C=C(/CCCCCCCC(O)=O)[N+]([O-])=O
: