Target
D(4) dopamine receptor
Ligand
BDBM50295052
Substrate
Meas. Tech.
ChEMBL_574199 (CHEMBL1062993)
Ki
1418±n/a nM
Citation
 Zhou, DStack, GPLo, JFailli, AAEvrard, DAHarrison, BLHatzenbuhler, NTTran, MCroce, SYi, SGolembieski, JHornby, GALai, MLin, QSchechter, LESmith, DLShilling, ADHuselton, CMitchell, PBeyer, CEAndree, TH Synthesis, potency, and in vivo evaluation of 2-piperazin-1-ylquinoline analogues as dual serotonin reuptake inhibitors and serotonin 5-HT1A receptor antagonists. J Med Chem 52:4955-9 (2009)  
Target
Name:
D(4) dopamine receptor
Synonyms:
D(2C) dopamine receptor DOPAMINE D4.2 DRD4 Dopamine D4 receptor
Type:
Enzyme
Mol. Mass.:
48373.19
Organism:
Homo sapiens (Human)
Description:
P21917
Residue:
419
  
Inhibitor
Name:
BDBM50295052
Synonyms:
2-(4-{[(2S)-8-Methyl-2,3-dihydro[1,4]dioxino[2,3-f]quinolin-2-yl]methyl}piperazin-1-yl)-quinoline-6-carbonitrile | CHEMBL551964
Type:
Small organic molecule
Emp. Form.:
C27H25N5O2
Mol. Mass.:
451.5197
SMILES:
Cc1ccc2c3O[C@@H](CN4CCN(CC4)c4ccc5cc(ccc5n4)C#N)COc3ccc2n1
: