Target
Sodium-dependent serotonin transporter
Ligand
BDBM50295054
Substrate
Meas. Tech.
ChEMBL_574190 (CHEMBL1060391)
Ki
3.9±n/a nM
Citation
 Zhou, DStack, GPLo, JFailli, AAEvrard, DAHarrison, BLHatzenbuhler, NTTran, MCroce, SYi, SGolembieski, JHornby, GALai, MLin, QSchechter, LESmith, DLShilling, ADHuselton, CMitchell, PBeyer, CEAndree, TH Synthesis, potency, and in vivo evaluation of 2-piperazin-1-ylquinoline analogues as dual serotonin reuptake inhibitors and serotonin 5-HT1A receptor antagonists. J Med Chem 52:4955-9 (2009)  
Target
Name:
Sodium-dependent serotonin transporter
Synonyms:
5-HT Transporter 5HT transporter Anandamid membrane transporter, AMT Monoamine transporters; Norepinephrine & serotonin Slc6a4 Sodium-dependent serotonin transporter (SERT) | imipramine receptor
Type:
Multi-pass membrane protein
Mol. Mass.:
70168.43
Organism:
Rattus norvegicus (rat)
Description:
P31652
Residue:
630
  
Inhibitor
Name:
BDBM50295054
Synonyms:
(2S)-2-{[4-(6-Fluoroquinolin-2-yl)-1,4-diazepan-1-yl]methyl}-8-methyl-2,3-dihydro[1,4]dioxino-[2,3-f]quinoline | CHEMBL551909
Type:
Small organic molecule
Emp. Form.:
C27H27FN4O2
Mol. Mass.:
458.5273
SMILES:
Cc1ccc2c3O[C@@H](CN4CCCN(CC4)c4ccc5cc(F)ccc5n4)COc3ccc2n1
: