Target
Interleukin-8
Ligand
BDBM13066
Substrate
Meas. Tech.
ChEMBL_577736 (CHEMBL1052371)
IC50
8±n/a nM
Citation
 Sablone, MRCesta, MCMoriconi, AAramini, ABizzarri, CDi Giacinto, CDi Bitondo, RGloaguen, IAschi, MCrucianelli, MBertini, RAllegretti, M Structure-Activity Relationship of novel phenylacetic CXCR1 inhibitors. Bioorg Med Chem Lett 19:4026-30 (2009)  
Target
Name:
Interleukin-8
Synonyms:
CXCL8 IL8_HUMAN interleukin 8 precursor
Type:
PROTEIN
Mol. Mass.:
11104.05
Organism:
Homo sapiens (Human)
Description:
ChEMBL_577736
Residue:
99
  
Inhibitor
Name:
BDBM13066
Synonyms:
2-{2-[(2,6-dichlorophenyl)amino]phenyl}acetic acid Diclofenac US11478464, Compound Diclofenac {2-[(2,6-dichlorophenyl)amino]phenyl}acetic acid
Type:
Small organic molecule
Emp. Form.:
C14H11Cl2NO2
Mol. Mass.:
296.149
SMILES:
OC(=O)Cc1ccccc1Nc1c(Cl)cccc1Cl
: