Target
Interleukin-8
Ligand
BDBM50295285
Substrate
Meas. Tech.
ChEMBL_577736 (CHEMBL1052371)
IC50
>1000±n/a nM
Citation
 Sablone, MRCesta, MCMoriconi, AAramini, ABizzarri, CDi Giacinto, CDi Bitondo, RGloaguen, IAschi, MCrucianelli, MBertini, RAllegretti, M Structure-Activity Relationship of novel phenylacetic CXCR1 inhibitors. Bioorg Med Chem Lett 19:4026-30 (2009)  
Target
Name:
Interleukin-8
Synonyms:
CXCL8 IL8_HUMAN interleukin 8 precursor
Type:
PROTEIN
Mol. Mass.:
11104.05
Organism:
Homo sapiens (Human)
Description:
ChEMBL_577736
Residue:
99
  
Inhibitor
Name:
BDBM50295285
Synonyms:
(4-Isobutyl-phenyl)-acetic acid CHEMBL341812 | Ibufenac
Type:
Small organic molecule
Emp. Form.:
C12H16O2
Mol. Mass.:
192.2542
SMILES:
CC(C)Cc1ccc(CC(O)=O)cc1
: