Target
NAD kinase
Ligand
BDBM50295363
Substrate
Meas. Tech.
ChEMBL_578493 (CHEMBL1063152)
IC50
80000±n/a nM
Citation
 Petrelli, RSham, YYChen, LFelczak, KBennett, EWilson, DAldrich, CYu, JSCappellacci, LFranchetti, PGrifantini, MMazzola, FDi Stefano, MMagni, GPankiewicz, KW Selective inhibition of nicotinamide adenine dinucleotide kinases by dinucleoside disulfide mimics of nicotinamide adenine dinucleotide analogues. Bioorg Med Chem 17:5656-64 (2009)  
Target
Name:
NAD kinase
Synonyms:
Inorganic polyphosphate/ATP-NAD kinase ppnK
Type:
PROTEIN
Mol. Mass.:
32896.75
Organism:
Mycobacterium tuberculosis
Description:
ChEMBL_578493
Residue:
307
  
Inhibitor
Name:
BDBM50295363
Synonyms:
(tiazofurin-5'-yl)(adenosin-5'-yl)disulfide | CHEMBL559921
Type:
Small organic molecule
Emp. Form.:
C19H23N7O7S3
Mol. Mass.:
557.624
SMILES:
NC(=O)c1csc(n1)[C@@H]1O[C@H](CSSC[C@H]2O[C@H]([C@H](O)[C@@H]2O)n2cnc3c(N)ncnc23)[C@@H](O)[C@H]1O
: