Target
Multidrug resistance-associated protein 1
Ligand
BDBM50295478
Substrate
Meas. Tech.
ChEMBL_579066 (CHEMBL1053127)
EC50
73±n/a nM
Citation
 Wong, ILChan, KFTsang, KHLam, CYZhao, YChan, THChow, LM Modulation of multidrug resistance protein 1 (MRP1/ABCC1)-mediated multidrug resistance by bivalent apigenin homodimers and their derivatives. J Med Chem 52:5311-22 (2009)  
Target
Name:
Multidrug resistance-associated protein 1
Synonyms:
7.6.2.2 ABCC1 ATP-binding cassette, sub-family C, member 1 isoform 1 LTC4 transporter MRP MRP1_HUMAN
Type:
Mol. Mass.:
171597.72
Organism:
Homo sapiens (Human)
Description:
P33527
Residue:
1531
  
Inhibitor
Name:
BDBM50295478
Synonyms:
1,16-Bis[40-((6-methyl)-4H-chromen-4-on-2-yl)phenyl]-1,4,7,10,13,16-hexaoxahexadecane | CHEMBL539987
Type:
Small organic molecule
Emp. Form.:
C42H42O10
Mol. Mass.:
706.7769
SMILES:
Cc1ccc2oc(cc(=O)c2c1)-c1ccc(OCCOCCOCCOCCOCCOc2ccc(cc2)-c2cc(=O)c3cc(C)ccc3o2)cc1
: