Target
Collagenase 3
Ligand
BDBM50295491
Substrate
Meas. Tech.
ChEMBL_579100 (CHEMBL1062302)
IC50
632±n/a nM
Citation
 Li, WLi, JWu, YRancati, FVallese, SRaveglia, LWu, JHotchandani, RFuller, NCunningham, KMorgan, PFish, SKrykbaev, RXu, XTam, SGoldman, SJAbraham, WWilliams, CSypek, JMansour, TS Identification of an orally efficacious matrix metalloprotease 12 inhibitor for potential treatment of asthma. J Med Chem 52:5408-19 (2009)  
Target
Name:
Collagenase 3
Synonyms:
MMP-13 MMP13_HUMAN Matrix metalloproteinase-13 (MMP-13) | Matrix metalloproteinase-13 (MMP13)
Type:
Enzyme
Mol. Mass.:
53808.06
Organism:
Homo sapiens (Human)
Description:
P45452
Residue:
471
  
Inhibitor
Name:
BDBM50295491
Synonyms:
(S)-2-(7-(Methoxycarbonylamino)dibenzo[b,d]thiophene-3-sulfonamido)-3-methylbutanoic Acid | CHEMBL562373
Type:
Small organic molecule
Emp. Form.:
C19H20N2O6S2
Mol. Mass.:
436.502
SMILES:
COC(=O)Nc1ccc2c(c1)sc1cc(ccc21)S(=O)(=O)N[C@@H](C(C)C)C(O)=O
: