Target
Hepatocyte growth factor receptor
Ligand
BDBM50295738
Substrate
Meas. Tech.
ChEMBL_577995 (CHEMBL1062250)
IC50
25200±n/a nM
Citation
 Porter, JLumb, SFranklin, RJGascon-Simorte, JMCalmiano, MRiche, KLLallemand, BKeyaerts, JEdwards, HMaloney, ADelgado, JKing, LFoley, ALecomte, FReuberson, JMeier, CBatchelor, M Discovery of 4-azaindoles as novel inhibitors of c-Met kinase. Bioorg Med Chem Lett 19:2780-4 (2009)  
Target
Name:
Hepatocyte growth factor receptor
Synonyms:
Hepatocyte growth factor receptor Hepatocyte growth factor receptor (c-MET) MET Met proto-oncogene (hepatocyte growth factor receptor) Tyrosine-protein kinase Met (c-Met) c-Met kinase
Type:
Protein
Mol. Mass.:
155559.73
Organism:
Homo sapiens (Human)
Description:
P08581
Residue:
1390
  
Inhibitor
Name:
BDBM50295738
Synonyms:
1-(3-(methylsulfonyl)phenylsulfonyl)-1H-pyrrolo[3,2-b]pyridine | CHEMBL561181
Type:
Small organic molecule
Emp. Form.:
C14H12N2O4S2
Mol. Mass.:
336.386
SMILES:
CS(=O)(=O)c1cccc(c1)S(=O)(=O)n1ccc2ncccc12
: