Target
Prolyl endopeptidase FAP
Ligand
BDBM50295979
Substrate
Meas. Tech.
ChEMBL_579024 (CHEMBL1052410)
IC50
>10000±n/a nM
Citation
 Betancort, JMWinn, DTLiu, RXu, QLiu, JLiao, WChen, SHCarney, DHanway, DSchmeits, JLi, XGordon, ECampbell, DA Bicyclic cyanothiazolidines as novel dipeptidyl peptidase 4 inhibitors. Bioorg Med Chem Lett 19:4437-40 (2009)  
Target
Name:
Prolyl endopeptidase FAP
Synonyms:
170 kDa melanoma membrane-bound gelatinase Fibroblast Activation Protein (FAP) Integral membrane serine protease Seprase
Type:
Enzyme
Mol. Mass.:
87712.48
Organism:
Homo sapiens (Human)
Description:
Q12884
Residue:
760
  
Inhibitor
Name:
BDBM50295979
Synonyms:
(3R,6R,7aS)-6-amino-6-(cyclohexylmethyl)-5-oxohexahydropyrrolo[2,1-b]thiazole-3-carbonitrile hydrochloride | CHEMBL556219
Type:
Small organic molecule
Emp. Form.:
C14H21N3OS
Mol. Mass.:
279.401
SMILES:
N[C@]1(CC2CCCCC2)C[C@@H]2SC[C@@H](C#N)N2C1=O
: