Target
Bifunctional epoxide hydrolase 2
Ligand
BDBM50296191
Substrate
Meas. Tech.
ChEMBL_579572 (CHEMBL1062360)
IC50
38±n/a nM
Citation
 Anandan, SKWebb, HKDo, ZNGless, RD Unsymmetrical non-adamantyl N,N'-diaryl urea and amide inhibitors of soluble expoxide hydrolase. Bioorg Med Chem Lett 19:4259-63 (2009)  
Target
Name:
Bifunctional epoxide hydrolase 2
Synonyms:
Cytosolic epoxide hydrolase 2 EPHX2 HYES_HUMAN Soluble epoxide hydrolase (sEH) | epoxide hydrolase 2, cytoplasmic
Type:
Enzyme
Mol. Mass.:
62613.07
Organism:
Homo sapiens (Human)
Description:
P34913
Residue:
555
  
Inhibitor
Name:
BDBM50296191
Synonyms:
1-(3-(3-morpholinopropoxy)phenyl)-3-phenylurea | CHEMBL540430
Type:
Small organic molecule
Emp. Form.:
C20H25N3O3
Mol. Mass.:
355.4308
SMILES:
O=C(Nc1ccccc1)Nc1cccc(OCCCN2CCOCC2)c1
: