Target
Carbonic anhydrase 15
Ligand
BDBM50237710
Substrate
Meas. Tech.
ChEMBL_579804 (CHEMBL1059705)
Ki
79±n/a nM
Citation
 Parkkila, SInnocenti, AKallio, HHilvo, MScozzafava, ASupuran, CT The protein tyrosine kinase inhibitors imatinib and nilotinib strongly inhibit several mammalian alpha-carbonic anhydrase isoforms. Bioorg Med Chem Lett 19:4102-6 (2009)  
Target
Name:
Carbonic anhydrase 15
Synonyms:
CAH15_MOUSE Car15
Type:
PROTEIN
Mol. Mass.:
35484.02
Organism:
Mus musculus
Description:
ChEMBL_651955
Residue:
324
  
Inhibitor
Name:
BDBM50237710
Synonyms:
4-methyl-N-[3-(4-methyl-1H-imidazol-1-yl)-5-(trifluoromethyl)phenyl]-3-[(4-pyridin-3-ylpyrimidin-2-yl)amino]benzamide AMN107 NILOTINIB | US11649218, Example Nilotinib
Type:
Small organic molecule
Emp. Form.:
C28H22F3N7O
Mol. Mass.:
529.5158
SMILES:
Cc1cn(cn1)-c1cc(NC(=O)c2ccc(C)c(Nc3nccc(n3)-c3cccnc3)c2)cc(c1)C(F)(F)F
: