Target
Receptor-type tyrosine-protein phosphatase F
Ligand
BDBM50296384
Substrate
Meas. Tech.
ChEMBL_580554 (CHEMBL1054000)
IC50
6469±n/a nM
Citation
 Lakshminarayana, NRajendra Prasad, YGharat, LThomas, ARavikumar, PNarayanan, SSrinivasan, CVGopalan, B Synthesis and evaluation of some novel isochroman carboxylic acid derivatives as potential anti-diabetic agents. Eur J Med Chem 44:3147-57 (2009)  
Target
Name:
Receptor-type tyrosine-protein phosphatase F
Synonyms:
LAR Leukocyte common antigen related (LAR) PTPRF_HUMAN Receptor-type tyrosine-protein phosphatase F (LAR)
Type:
Protein
Mol. Mass.:
212869.85
Organism:
Homo sapiens (Human)
Description:
P10586
Residue:
1907
  
Inhibitor
Name:
BDBM50296384
Synonyms:
(3S)-7-{4-[(4S)-2-Oxoperhydrothieno-[3,4-d]imidazol-4-yl]butylcarboxamido}-isochroman-3-carboxylic acid | CHEMBL549505
Type:
Small organic molecule
Emp. Form.:
C20H25N3O5S
Mol. Mass.:
419.495
SMILES:
OC(=O)[C@@H]1Cc2ccc(NC(=O)CCCC[C@@H]3SCC4NC(=O)NC34)cc2CO1
: