Target
Dipeptidyl peptidase 4
Ligand
BDBM50296487
Substrate
Meas. Tech.
ChEMBL_581931 (CHEMBL1054112)
IC50
24±n/a nM
Citation
 Edmondson, SDMastracchio, ACox, JMEiermann, GJHe, HLyons, KAPatel, RAPatel, SBPetrov, AScapin, GWu, JKXu, SZhu, BThornberry, NARoy, RSWeber, AE Aminopiperidine-fused imidazoles as dipeptidyl peptidase-IV inhibitors. Bioorg Med Chem Lett 19:4097-101 (2009)  
Target
Name:
Dipeptidyl peptidase 4
Synonyms:
ADABP Adenosine deaminase complexing protein 2 CD_antigen=CD26 DPP4 DPPIV Dipeptidyl peptidase 4 (DPP IV) Dipeptidyl peptidase 4 (DPP4) Dipeptidyl peptidase 4 membrane form Dipeptidyl peptidase IV Dipeptidyl peptidase IV (DDP-IV) Dipeptidyl peptidase IV membrane form Dipeptidyl peptidase-IV (DPP-4) T-cell activation antigen CD26 | TP103
Type:
Enzyme
Mol. Mass.:
88271.01
Organism:
Homo sapiens (Human)
Description:
P27487
Residue:
766
  
Inhibitor
Name:
BDBM50296487
Synonyms:
(11R,12R)-12-azaniumyl-11-(2,4,5-trifluorophenyl)-1,6,8-triazatricyclo[7.4.0.0^{2,7}]trideca-2(7),3,5,8-tetraen-6-ium; bis(2,2,2-trifluoroacetate) | CHEMBL562388
Type:
Small organic molecule
Emp. Form.:
C16H15F3N4
Mol. Mass.:
320.3112
SMILES:
[NH3+][C@H]1C[n+]2c(C[C@@H]1c1cc(F)c(F)cc1F)[nH]c1ncccc21
: