Target
Cytochrome P450 2D6
Ligand
BDBM50296489
Substrate
Meas. Tech.
ChEMBL_581933 (CHEMBL1054114)
IC50
13000±n/a nM
Citation
 Edmondson, SDMastracchio, ACox, JMEiermann, GJHe, HLyons, KAPatel, RAPatel, SBPetrov, AScapin, GWu, JKXu, SZhu, BThornberry, NARoy, RSWeber, AE Aminopiperidine-fused imidazoles as dipeptidyl peptidase-IV inhibitors. Bioorg Med Chem Lett 19:4097-101 (2009)  
Target
Name:
Cytochrome P450 2D6
Synonyms:
CP2D6_HUMAN CYP2DL1 Cytochrome P450 2D6 (CYP2D6) P450-DB1
Type:
Protein
Mol. Mass.:
55774.82
Organism:
Homo sapiens (Human)
Description:
P10635
Residue:
497
  
Inhibitor
Name:
BDBM50296489
Synonyms:
(11R,12R)-12-azaniumyl-11-(2,4,5-trifluorophenyl)-1,5,8-triazatricyclo[7.4.0.0^{2,7}]trideca-2(7),3,5,8-tetraen-5-ium; bis(2,2,2-trifluoroacetate) | CHEMBL562188
Type:
Small organic molecule
Emp. Form.:
C16H15F3N4
Mol. Mass.:
320.3112
SMILES:
[NH3+][C@H]1C[n+]2c(C[C@@H]1c1cc(F)c(F)cc1F)[nH]c1cnccc21
: