Target
Thromboxane A2 receptor
Ligand
BDBM50296978
Substrate
Meas. Tech.
ChEMBL_580962 (CHEMBL1054927)
IC50
62600±n/a nM
Citation
 Stearns, BABaccei, CBain, GBroadhead, AClark, RCCoate, HEvans, JFFagan, PHutchinson, JHKing, CLee, CLorrain, DSPrasit, PProdanovich, PSantini, AScott, JMStock, NSTruong, YP Novel tricyclic antagonists of the prostaglandin D2 receptor DP2 with efficacy in a murine model of allergic rhinitis. Bioorg Med Chem Lett 19:4647-51 (2009)  
Target
Name:
Thromboxane A2 receptor
Synonyms:
Prostanoid TP receptor TBXA2R Thromboxane Thromboxane Beta
Type:
Enyzme
Mol. Mass.:
37445.28
Organism:
Homo sapiens (Human)
Description:
P21731
Residue:
343
  
Inhibitor
Name:
BDBM50296978
Synonyms:
2-(4,6-bis(dimethylamino)-2-(4-(4-(trifluoromethyl)benzamido)benzyl)pyrimidin-5-yl)acetic acid | CHEMBL551813
Type:
Small organic molecule
Emp. Form.:
C25H26F3N5O3
Mol. Mass.:
501.5008
SMILES:
CN(C)c1nc(Cc2ccc(NC(=O)c3ccc(cc3)C(F)(F)F)cc2)nc(N(C)C)c1CC(O)=O
: