Target
Thromboxane A2 receptor
Ligand
BDBM50296983
Substrate
Meas. Tech.
ChEMBL_580962 (CHEMBL1054927)
IC50
>100000±n/a nM
Citation
 Stearns, BABaccei, CBain, GBroadhead, AClark, RCCoate, HEvans, JFFagan, PHutchinson, JHKing, CLee, CLorrain, DSPrasit, PProdanovich, PSantini, AScott, JMStock, NSTruong, YP Novel tricyclic antagonists of the prostaglandin D2 receptor DP2 with efficacy in a murine model of allergic rhinitis. Bioorg Med Chem Lett 19:4647-51 (2009)  
Target
Name:
Thromboxane A2 receptor
Synonyms:
Prostanoid TP receptor TBXA2R Thromboxane Thromboxane Beta
Type:
Enyzme
Mol. Mass.:
37445.28
Organism:
Homo sapiens (Human)
Description:
P21731
Residue:
343
  
Inhibitor
Name:
BDBM50296983
Synonyms:
(R)-2-(8-(4-fluoro-N-methylphenylsulfonamido)-6,7,8,9-tetrahydro-5H-pyrido[3,2-b]indol-5-yl)acetic acid | CHEMBL550465
Type:
Small organic molecule
Emp. Form.:
C20H20FN3O4S
Mol. Mass.:
417.454
SMILES:
CN([C@@H]1CCc2c(C1)c1ncccc1n2CC(O)=O)S(=O)(=O)c1ccc(F)cc1
: