Target
Prostacyclin receptor
Ligand
BDBM50296983
Substrate
Meas. Tech.
ChEMBL_580963 (CHEMBL1054928)
IC50
>100000±n/a nM
Citation
 Stearns, BABaccei, CBain, GBroadhead, AClark, RCCoate, HEvans, JFFagan, PHutchinson, JHKing, CLee, CLorrain, DSPrasit, PProdanovich, PSantini, AScott, JMStock, NSTruong, YP Novel tricyclic antagonists of the prostaglandin D2 receptor DP2 with efficacy in a murine model of allergic rhinitis. Bioorg Med Chem Lett 19:4647-51 (2009)  
Target
Name:
Prostacyclin receptor
Synonyms:
PGI receptor PRIPR Prostacyclin (IP) Receptor Prostaglandin I Prostaglandin I2 receptor | Prostanoid IP receptor
Type:
G Protein-Coupled Receptor (GPCR)
Mol. Mass.:
40968.22
Organism:
Homo sapiens (Human)
Description:
The membranes prepared from human platelet were used in binding assay.
Residue:
386
  
Inhibitor
Name:
BDBM50296983
Synonyms:
(R)-2-(8-(4-fluoro-N-methylphenylsulfonamido)-6,7,8,9-tetrahydro-5H-pyrido[3,2-b]indol-5-yl)acetic acid | CHEMBL550465
Type:
Small organic molecule
Emp. Form.:
C20H20FN3O4S
Mol. Mass.:
417.454
SMILES:
CN([C@@H]1CCc2c(C1)c1ncccc1n2CC(O)=O)S(=O)(=O)c1ccc(F)cc1
: