Target
Cytochrome P450 2C9
Ligand
BDBM50296984
Substrate
Meas. Tech.
ChEMBL_580965 (CHEMBL1054930)
IC50
>30000±n/a nM
Citation
 Stearns, BABaccei, CBain, GBroadhead, AClark, RCCoate, HEvans, JFFagan, PHutchinson, JHKing, CLee, CLorrain, DSPrasit, PProdanovich, PSantini, AScott, JMStock, NSTruong, YP Novel tricyclic antagonists of the prostaglandin D2 receptor DP2 with efficacy in a murine model of allergic rhinitis. Bioorg Med Chem Lett 19:4647-51 (2009)  
Target
Name:
Cytochrome P450 2C9
Synonyms:
(R)-limonene 6-monooxygenase CP2C9_HUMAN CYP2C9 Cytochrome P450 2C9 (CYP2C9 ) P-450MP P450 PB-1 | S-mephenytoin 4-hydroxylase
Type:
Enzyme
Mol. Mass.:
55636.33
Organism:
Homo sapiens (Human)
Description:
P11712
Residue:
490
  
Inhibitor
Name:
BDBM50296984
Synonyms:
(R)-2-(6-(4-fluoro-N-methylphenylsulfonamido)-7,8-dihydro-5H-pyrido[3,4-b]indol-9(6H)-yl)acetic acid | CHEMBL550868
Type:
Small organic molecule
Emp. Form.:
C20H20FN3O4S
Mol. Mass.:
417.454
SMILES:
CN([C@@H]1CCc2c(C1)c1ccncc1n2CC(O)=O)S(=O)(=O)c1ccc(F)cc1
: