Target
Cytochrome P450 2D6
Ligand
BDBM50296983
Substrate
Meas. Tech.
ChEMBL_580966 (CHEMBL1054931)
IC50
>30000±n/a nM
Citation
 Stearns, BABaccei, CBain, GBroadhead, AClark, RCCoate, HEvans, JFFagan, PHutchinson, JHKing, CLee, CLorrain, DSPrasit, PProdanovich, PSantini, AScott, JMStock, NSTruong, YP Novel tricyclic antagonists of the prostaglandin D2 receptor DP2 with efficacy in a murine model of allergic rhinitis. Bioorg Med Chem Lett 19:4647-51 (2009)  
Target
Name:
Cytochrome P450 2D6
Synonyms:
CP2D6_HUMAN CYP2DL1 Cytochrome P450 2D6 (CYP2D6) P450-DB1
Type:
Protein
Mol. Mass.:
55774.82
Organism:
Homo sapiens (Human)
Description:
P10635
Residue:
497
  
Inhibitor
Name:
BDBM50296983
Synonyms:
(R)-2-(8-(4-fluoro-N-methylphenylsulfonamido)-6,7,8,9-tetrahydro-5H-pyrido[3,2-b]indol-5-yl)acetic acid | CHEMBL550465
Type:
Small organic molecule
Emp. Form.:
C20H20FN3O4S
Mol. Mass.:
417.454
SMILES:
CN([C@@H]1CCc2c(C1)c1ncccc1n2CC(O)=O)S(=O)(=O)c1ccc(F)cc1
: