Target
MAP kinase-activated protein kinase 2
Ligand
BDBM50297113
Substrate
Meas. Tech.
ChEMBL_581771 (CHEMBL1061558)
IC50
5±n/a nM
Citation
 Anderson, DRMeyers, MJKurumbail, RGCaspers, NPoda, GILong, SAPierce, BSMahoney, MWMourey, RJParikh, MD Benzothiophene inhibitors of MK2. Part 2: improvements in kinase selectivity and cell potency. Bioorg Med Chem Lett 19:4882-4 (2009)  
Target
Name:
MAP kinase-activated protein kinase 2
Synonyms:
MAP kinase-activated protein kinase 2 (MAPKAPK2) MAP kinase-activated protein kinase 2 (p38/MK2) MAPK-activated protein kinase 2 MAPKAP kinase 2 MAPKAPK2 | MK2
Type:
Serine/threonine-protein kinase
Mol. Mass.:
45579.87
Organism:
Homo sapiens (Human)
Description:
P49137
Residue:
400
  
Inhibitor
Name:
BDBM50297113
Synonyms:
(R)-10-Methyl-3-pyridin-3-yl-9,10,11,12-tetrahydro-7-thia-4,9,12-triaza-naphtho[1,2-a]azulen-8-one | CHEMBL560075
Type:
Small organic molecule
Emp. Form.:
C20H16N4OS
Mol. Mass.:
360.432
SMILES:
C[C@@H]1CNc2c(sc3ccc4nc(ccc4c23)-c2cccnc2)C(=O)N1
: