Target
Cyclin-dependent kinase 1
Ligand
BDBM50297126
Substrate
Meas. Tech.
ChEMBL_581772 (CHEMBL1061559)
IC50
390±n/a nM
Citation
 Anderson, DRMeyers, MJKurumbail, RGCaspers, NPoda, GILong, SAPierce, BSMahoney, MWMourey, RJParikh, MD Benzothiophene inhibitors of MK2. Part 2: improvements in kinase selectivity and cell potency. Bioorg Med Chem Lett 19:4882-4 (2009)  
Target
Name:
Cyclin-dependent kinase 1
Synonyms:
CDC2 CDK1 CDKN1 Cell division protein kinase 1 P34CDC2 | p34 protein kinase
Type:
Enzyme Subunit
Mol. Mass.:
34101.08
Organism:
Homo sapiens (Human)
Description:
P06493
Residue:
297
  
Inhibitor
Name:
BDBM50297126
Synonyms:
(R)-10-Methyl-3-pyridin-4-yl-9,10,11,12-tetrahydro-7-thia-4,9,12-triaza-naphtho[1,2-a]azulen-8-one | CHEMBL552339
Type:
Small organic molecule
Emp. Form.:
C20H16N4OS
Mol. Mass.:
360.432
SMILES:
C[C@@H]1CNc2c(sc3ccc4nc(ccc4c23)-c2ccncc2)C(=O)N1
: