Target
Potassium voltage-gated channel subfamily H member 2
Ligand
BDBM50297310
Substrate
Meas. Tech.
ChEMBL_582986 (CHEMBL1051824)
IC50
1200±n/a nM
Citation
 Moree, WJLi, BFJovic, FCoon, TYu, JGross, RSTucci, FMarinkovic, DZamani-Kord, SMalany, SBradbury, MJHernandez, LMO'Brien, ZWen, JWang, HHoare, SRPetroski, RESacaan, AMadan, ACrowe, PDBeaton, G Characterization of novel selective H1-antihistamines for clinical evaluation in the treatment of insomnia. J Med Chem 52:5307-10 (2009)  
Target
Name:
Potassium voltage-gated channel subfamily H member 2
Synonyms:
1,3-beta-glucan synthase component GLS2 ERG Eag-related protein 1 Ether-a-go-go-related gene (HERG) Ether-a-go-go-related gene potassium channel 1 Ether-a-go-go-related gene potassium channel 1 (hERG1) Ether-a-go-go-related protein 1 H-ERG KCNH2 Potassium voltage-gated channel subfamily H member 2 (hERG) Voltage-gated potassium channel subunit Kv11.1 hERG Potassium Channel 1 | putative potassium channel subunit
Type:
Multi-pass membrane protein
Mol. Mass.:
126672.65
Organism:
Homo sapiens (Human)
Description:
Q12809
Residue:
1159
  
Inhibitor
Name:
BDBM50297310
Synonyms:
(-)-Dimethyl-{2-[3-((R)-1-pyridin-2-yl-ethyl)-benzofuran-2-yl]-ethyl}-amine | CHEMBL563920
Type:
Small organic molecule
Emp. Form.:
C19H22N2O
Mol. Mass.:
294.3908
SMILES:
C[C@H](c1c(CCN(C)C)oc2ccccc12)c1ccccn1
: