Target
Histamine H1 receptor
Ligand
BDBM50297307
Substrate
Meas. Tech.
ChEMBL_582981 (CHEMBL1051819)
Ki
0.4±n/a nM
Citation
 Moree, WJLi, BFJovic, FCoon, TYu, JGross, RSTucci, FMarinkovic, DZamani-Kord, SMalany, SBradbury, MJHernandez, LMO'Brien, ZWen, JWang, HHoare, SRPetroski, RESacaan, AMadan, ACrowe, PDBeaton, G Characterization of novel selective H1-antihistamines for clinical evaluation in the treatment of insomnia. J Med Chem 52:5307-10 (2009)  
Target
Name:
Histamine H1 receptor
Synonyms:
H1R HISTAMINE H1 HRH1_HUMAN
Type:
G Protein-Coupled Receptor (GPCR)
Mol. Mass.:
55808.72
Organism:
Homo sapiens (Human)
Description:
Cell pellets from SK-N-MC cells transfected with human H1 receptor were used in binding assay.
Residue:
487
  
Inhibitor
Name:
BDBM50297307
Synonyms:
CHEMBL564226 | R-dimethindene
Type:
Small organic molecule
Emp. Form.:
C20H24N2
Mol. Mass.:
292.418
SMILES:
C[C@H](C1=C(CCN(C)C)Cc2ccccc12)c1ccccn1
: