Target
Cytochrome P450 2C19
Ligand
BDBM50297385
Substrate
Meas. Tech.
ChEMBL_582716 (CHEMBL1054978)
IC50
>50±n/a nM
Citation
 Hutchinson, JHLi, YArruda, JMBaccei, CBain, GChapman, CCorrea, LDarlington, JKing, CDLee, CLorrain, DProdanovich, PRong, HSantini, AStock, NPrasit, PEvans, JF 5-lipoxygenase-activating protein inhibitors: development of 3-[3-tert-butylsulfanyl-1-[4-(6-methoxy-pyridin-3-yl)-benzyl]-5-(pyridin-2-ylmethoxy)-1H-indol-2-yl]-2,2-dimethyl-propionic acid (AM103). J Med Chem 52:5803-15 (2009)  
Target
Name:
Cytochrome P450 2C19
Synonyms:
CP2CJ_HUMAN CYPIIC17 Cytochrome P450 2C19 (CYP2C19) Mephenytoin 4-hydroxylase P450-254C
Type:
Enzyme
Mol. Mass.:
55935.47
Organism:
Homo sapiens (Human)
Description:
P33261
Residue:
490
  
Inhibitor
Name:
BDBM50297385
Synonyms:
3-[3-tert-Butylsulfanyl-1-[4-(6-methoxy-pyridin-3-yl)-benzyl]-5-(pyridin-2-ylmethoxy)-1H-indol-2-yl]-2,2-dimethylpropionic Acid | CHEMBL557527
Type:
Small organic molecule
Emp. Form.:
C36H39N3O4S
Mol. Mass.:
609.778
SMILES:
COc1ccc(cn1)-c1ccc(Cn2c(CC(C)(C)C(O)=O)c(SC(C)(C)C)c3cc(OCc4ccccn4)ccc23)cc1
: