Target
Histone deacetylase 5
Ligand
BDBM50297446
Substrate
Meas. Tech.
ChEMBL_585888 (CHEMBL1053559)
IC50
140.00±n/a nM
Citation
 Giannini, GMarzi, MMarzo, MDBattistuzzi, GPezzi, RBrunetti, TCabri, WVesci, LPisano, C Exploring bis-(indolyl)methane moiety as an alternative and innovative CAP group in the design of histone deacetylase (HDAC) inhibitors. Bioorg Med Chem Lett 19:2840-3 (2009)  
Target
Name:
Histone deacetylase 5
Synonyms:
Antigen NY-CO-9 HDAC5 Histone acetylase 5 (HDAC5) Human HDAC5 | KIAA0600
Type:
Enzyme
Mol. Mass.:
121968.61
Organism:
Homo sapiens (Human)
Description:
Q9UQL6
Residue:
1122
  
Inhibitor
Name:
BDBM50297446
Synonyms:
CHEMBL561604 ST-5732
Type:
Small organic molecule
Emp. Form.:
C23H23N5O6
Mol. Mass.:
465.4586
SMILES:
ONC(=O)CCCCCC(c1c[nH]c2ccc(cc12)[N+]([O-])=O)c1c[nH]c2ccc(cc12)[N+]([O-])=O
: