Target
Mitogen-activated protein kinase 1
Ligand
BDBM50297480
Substrate
Meas. Tech.
ChEMBL_586024 (CHEMBL1063581)
Ki
25000±n/a nM
Citation
 Cao, JGao, HBemis, GSalituro, FLedeboer, MHarrington, EWilke, STaslimi, PPazhanisamy, SXie, XJacobs, MGreen, J Structure-based design and parallel synthesis of N-benzyl isatin oximes as JNK3 MAP kinase inhibitors. Bioorg Med Chem Lett 19:2891-5 (2009)  
Target
Name:
Mitogen-activated protein kinase 1
Synonyms:
ERK2 Extracellular signal-regulated kinase 2 Extracellular signal-regulated kinase 2 (ERK2) MAPK 2 MK01_HUMAN Mitogen-activated protein kinase 1 (ERK-2) Mitogen-activated protein kinase 2 PRKM2 | p42-MAPK
Type:
Ser/Thr Protein Kinase
Mol. Mass.:
41392.76
Organism:
Homo sapiens (Human)
Description:
P28482
Residue:
360
  
Inhibitor
Name:
BDBM50297480
Synonyms:
(3Z)-1-[(6-fluoro-4H-1,3-benzodioxin-8-yl)methyl]-4-phenyl-1H-indole-2,3-dione 3-oxime CHEMBL549385
Type:
Small organic molecule
Emp. Form.:
C23H17FN2O4
Mol. Mass.:
404.3905
SMILES:
Fc1cc(CN2C(=O)C(N=O)c3c2cccc3-c2ccccc2)c2OCOCc2c1
: