Target
Lysine--tRNA ligase
Ligand
BDBM50297455
Substrate
Meas. Tech.
ChEMBL_586036 (CHEMBL1063593)
Ki
>30000±n/a nM
Citation
 Cao, JGao, HBemis, GSalituro, FLedeboer, MHarrington, EWilke, STaslimi, PPazhanisamy, SXie, XJacobs, MGreen, J Structure-based design and parallel synthesis of N-benzyl isatin oximes as JNK3 MAP kinase inhibitors. Bioorg Med Chem Lett 19:2891-5 (2009)  
Target
Name:
Lysine--tRNA ligase
Synonyms:
KARS KIAA0070 SYK_HUMAN
Type:
PROTEIN
Mol. Mass.:
68044.78
Organism:
Homo sapiens (Human)
Description:
ChEMBL_960665
Residue:
597
  
Inhibitor
Name:
BDBM50297455
Synonyms:
1-((6-fluoro-4H-benzo[d][1,3]dioxin-8-yl)methyl)-3-(hydroxyimino)-6-methylindolin-2-one | CHEMBL551140
Type:
Small organic molecule
Emp. Form.:
C18H15FN2O4
Mol. Mass.:
342.3211
SMILES:
Cc1ccc2C(N=O)C(=O)N(Cc3cc(F)cc4COCOc34)c2c1
: