Target
Mitogen-activated protein kinase 1
Ligand
BDBM50297454
Substrate
Meas. Tech.
ChEMBL_586024 (CHEMBL1063581)
Ki
>15000±n/a nM
Citation
 Cao, JGao, HBemis, GSalituro, FLedeboer, MHarrington, EWilke, STaslimi, PPazhanisamy, SXie, XJacobs, MGreen, J Structure-based design and parallel synthesis of N-benzyl isatin oximes as JNK3 MAP kinase inhibitors. Bioorg Med Chem Lett 19:2891-5 (2009)  
Target
Name:
Mitogen-activated protein kinase 1
Synonyms:
ERK2 Extracellular signal-regulated kinase 2 Extracellular signal-regulated kinase 2 (ERK2) MAPK 2 MK01_HUMAN Mitogen-activated protein kinase 1 (ERK-2) Mitogen-activated protein kinase 2 PRKM2 | p42-MAPK
Type:
Ser/Thr Protein Kinase
Mol. Mass.:
41392.76
Organism:
Homo sapiens (Human)
Description:
P28482
Residue:
360
  
Inhibitor
Name:
BDBM50297454
Synonyms:
1-((6-fluoro-4H-benzo[d][1,3]dioxin-8-yl)methyl)-3-(hydroxyimino)-4-phenethylindolin-2-one | CHEMBL559885
Type:
Small organic molecule
Emp. Form.:
C25H21FN2O4
Mol. Mass.:
432.4436
SMILES:
Fc1cc(CN2C(=O)C(N=O)c3c2cccc3CCc2ccccc2)c2OCOCc2c1
: