Target
Progesterone receptor
Ligand
BDBM50298029
Substrate
Meas. Tech.
ChEMBL_585096 (CHEMBL1054362)
EC50
200±n/a nM
Citation
 Thompson, SKWashburn, DGFrazee, JSMadauss, KPHoang, THLapinski, LGrygielko, ETGlace, LETrizna, WWilliams, SPDuraiswami, CBray, JDLaping, NJ Rational design of orally-active, pyrrolidine-based progesterone receptor partial agonists. Bioorg Med Chem Lett 19:4777-80 (2009)  
Target
Name:
Progesterone receptor
Synonyms:
NR3C3 PGR PRGR_HUMAN | progesterone
Type:
Protein
Mol. Mass.:
98979.52
Organism:
Homo sapiens (Human)
Description:
P06401
Residue:
933
  
Inhibitor
Name:
BDBM50298029
Synonyms:
(S)-2-chloro-4-((2-chlorobenzyl)(1-isopropylpyrrolidin-3-yl)amino)benzonitrile | CHEMBL551081
Type:
Small organic molecule
Emp. Form.:
C21H23Cl2N3
Mol. Mass.:
388.333
SMILES:
CC(C)N1CC[C@@H](C1)N(Cc1ccccc1Cl)c1ccc(C#N)c(Cl)c1
: