Target
Progesterone receptor
Ligand
BDBM50298030
Substrate
Meas. Tech.
ChEMBL_585096 (CHEMBL1054362)
EC50
200±n/a nM
Citation
 Thompson, SKWashburn, DGFrazee, JSMadauss, KPHoang, THLapinski, LGrygielko, ETGlace, LETrizna, WWilliams, SPDuraiswami, CBray, JDLaping, NJ Rational design of orally-active, pyrrolidine-based progesterone receptor partial agonists. Bioorg Med Chem Lett 19:4777-80 (2009)  
Target
Name:
Progesterone receptor
Synonyms:
NR3C3 PGR PRGR_HUMAN | progesterone
Type:
Protein
Mol. Mass.:
98979.52
Organism:
Homo sapiens (Human)
Description:
P06401
Residue:
933
  
Inhibitor
Name:
BDBM50298030
Synonyms:
(S)-2-chloro-4-((2-chlorobenzyl)(1-(3,3,3-trifluoropropyl)pyrrolidin-3-yl)amino)benzonitrile | CHEMBL563609
Type:
Small organic molecule
Emp. Form.:
C21H20Cl2F3N3
Mol. Mass.:
442.305
SMILES:
FC(F)(F)CCN1CC[C@@H](C1)N(Cc1ccccc1Cl)c1ccc(C#N)c(Cl)c1
: