Target
Progesterone receptor
Ligand
BDBM50298034
Substrate
Meas. Tech.
ChEMBL_585095 (CHEMBL1054361)
IC50
63±n/a nM
Citation
 Thompson, SKWashburn, DGFrazee, JSMadauss, KPHoang, THLapinski, LGrygielko, ETGlace, LETrizna, WWilliams, SPDuraiswami, CBray, JDLaping, NJ Rational design of orally-active, pyrrolidine-based progesterone receptor partial agonists. Bioorg Med Chem Lett 19:4777-80 (2009)  
Target
Name:
Progesterone receptor
Synonyms:
NR3C3 PGR PRGR_HUMAN | progesterone
Type:
Protein
Mol. Mass.:
98979.52
Organism:
Homo sapiens (Human)
Description:
P06401
Residue:
933
  
Inhibitor
Name:
BDBM50298034
Synonyms:
(S)-2-(3-((3-chloro-4-cyanophenyl)(2-chlorobenzyl)amino)pyrrolidin-1-yl)acetamide | CHEMBL560885
Type:
Small organic molecule
Emp. Form.:
C20H20Cl2N4O
Mol. Mass.:
403.305
SMILES:
NC(=O)CN1CC[C@@H](C1)N(Cc1ccccc1Cl)c1ccc(C#N)c(Cl)c1
: