Target
Progesterone receptor
Ligand
BDBM50298043
Substrate
Meas. Tech.
ChEMBL_585095 (CHEMBL1054361)
IC50
20±n/a nM
Citation
 Thompson, SKWashburn, DGFrazee, JSMadauss, KPHoang, THLapinski, LGrygielko, ETGlace, LETrizna, WWilliams, SPDuraiswami, CBray, JDLaping, NJ Rational design of orally-active, pyrrolidine-based progesterone receptor partial agonists. Bioorg Med Chem Lett 19:4777-80 (2009)  
Target
Name:
Progesterone receptor
Synonyms:
NR3C3 PGR PRGR_HUMAN | progesterone
Type:
Protein
Mol. Mass.:
98979.52
Organism:
Homo sapiens (Human)
Description:
P06401
Residue:
933
  
Inhibitor
Name:
BDBM50298043
Synonyms:
(S)-2-chloro-4-((2-chlorobenzyl)(1-methylpyrrolidin-3-yl)amino)benzonitrile | CHEMBL568906
Type:
Small organic molecule
Emp. Form.:
C19H19Cl2N3
Mol. Mass.:
360.28
SMILES:
CN1CC[C@@H](C1)N(Cc1ccccc1Cl)c1ccc(C#N)c(Cl)c1
: