Target
Progesterone receptor
Ligand
BDBM50298046
Substrate
Meas. Tech.
ChEMBL_585096 (CHEMBL1054362)
EC50
>10000±n/a nM
Citation
 Thompson, SKWashburn, DGFrazee, JSMadauss, KPHoang, THLapinski, LGrygielko, ETGlace, LETrizna, WWilliams, SPDuraiswami, CBray, JDLaping, NJ Rational design of orally-active, pyrrolidine-based progesterone receptor partial agonists. Bioorg Med Chem Lett 19:4777-80 (2009)  
Target
Name:
Progesterone receptor
Synonyms:
NR3C3 PGR PRGR_HUMAN | progesterone
Type:
Protein
Mol. Mass.:
98979.52
Organism:
Homo sapiens (Human)
Description:
P06401
Residue:
933
  
Inhibitor
Name:
BDBM50298046
Synonyms:
(S)-2-chloro-4-((2,6-dichlorobenzyl)(1-methylpyrrolidin-3-yl)amino)benzonitrile | CHEMBL557331
Type:
Small organic molecule
Emp. Form.:
C19H18Cl3N3
Mol. Mass.:
394.725
SMILES:
CN1CC[C@@H](C1)N(Cc1c(Cl)cccc1Cl)c1ccc(C#N)c(Cl)c1
: