Target
Renin
Ligand
BDBM17949
Substrate
Meas. Tech.
ChEMBL_585345 (CHEMBL1054384)
IC50
1±n/a nM
Citation
 Yamaguchi, YMenear, KCohen, NCMah, RCumin, FSchnell, CWood, JMMaibaum, J The P1N-isopropyl motif bearing hydroxyethylene dipeptide isostere analogues of aliskiren are in vitro potent inhibitors of the human aspartyl protease renin. Bioorg Med Chem Lett 19:4863-7 (2009)  
Target
Name:
Renin
Synonyms:
Angiotensinogenase RENI_HUMAN
Type:
Enzyme
Mol. Mass.:
45058.99
Organism:
Homo sapiens (Human)
Description:
Residue:
406
  
Inhibitor
Name:
BDBM17949
Synonyms:
(2R,4S,5S,7S)-5-amino-N-butyl-4-hydroxy-7-{[4-methoxy-3-(3-methoxypropoxy)phenyl]methyl}-2,8-dimethylnonanamide Renin nonpeptide inhibitor, 9
Type:
Small organic molecule
Emp. Form.:
C27H48N2O5
Mol. Mass.:
480.6804
SMILES:
CCCCNC(=O)[C@H](C)C[C@H](O)[C@@H](N)C[C@H](Cc1ccc(OC)c(OCCCOC)c1)C(C)C
: