Target
Progesterone receptor
Ligand
BDBM50298207
Substrate
Meas. Tech.
ChEMBL_585528 (CHEMBL1062692)
EC50
0.3±n/a nM
Citation
 Washburn, DGHoang, THFrazee, JSJohnson, LHammond, MManns, SMadauss, KPWilliams, SPDuraiswami, CTran, TBStewart, ELGrygielko, ETGlace, LETrizna, WNagilla, RBray, JDThompson, SK Discovery of orally active, pyrrolidinone-based progesterone receptor partial agonists. Bioorg Med Chem Lett 19:4664-8 (2009)  
Target
Name:
Progesterone receptor
Synonyms:
NR3C3 PGR PRGR_HUMAN | progesterone
Type:
Protein
Mol. Mass.:
98979.52
Organism:
Homo sapiens (Human)
Description:
P06401
Residue:
933
  
Inhibitor
Name:
BDBM50298207
Synonyms:
(S)-2-chloro-4-((2-chlorobenzyl)(1-isopropyl-5-oxopyrrolidin-3-yl)amino)benzonitrile | CHEMBL559327
Type:
Small organic molecule
Emp. Form.:
C21H21Cl2N3O
Mol. Mass.:
402.317
SMILES:
CC(C)N1C[C@H](CC1=O)N(Cc1ccccc1Cl)c1ccc(C#N)c(Cl)c1
: