Target
Adenosine receptor A2a
Ligand
BDBM50298556
Substrate
Meas. Tech.
ChEMBL_587703 (CHEMBL1037717)
Ki
193±n/a nM
Citation
 Michielan, LBolcato, CFederico, SCacciari, BBacilieri, MKlotz, KNKachler, SPastorin, GCardin, RSperduti, ASpalluto, GMoro, S Combining selectivity and affinity predictions using an integrated Support Vector Machine (SVM) approach: An alternative tool to discriminate between the human adenosine A(2A) and A(3) receptor pyrazolo-triazolo-pyrimidine antagonists binding sites. Bioorg Med Chem 17:5259-74 (2009)  
Target
Name:
Adenosine receptor A2a
Synonyms:
A2A adenosine receptor (hA2A) ADENOSINE A2 ADORA2 Adenosine A2A receptor (A2AAR)
Type:
G Protein-Coupled Receptor (GPCR)
Mol. Mass.:
44716.46
Organism:
Homo sapiens (Human)
Description:
P29274
Residue:
412
  
Inhibitor
Name:
BDBM50298556
Synonyms:
5-[(4-Biphenylmethyl)carbonyl]amino-8-methyl-2-(2-furyl)-pyrazolo[4,3-e]1,2,4-triazolo[1,5-c]pyrimidine | CHEMBL574323
Type:
Small organic molecule
Emp. Form.:
C25H19N7O2
Mol. Mass.:
449.4641
SMILES:
Cn1cc2c(n1)nc(NC(=O)Cc1ccc(cc1)-c1ccccc1)n1nc(nc21)-c1ccco1
: