Target
Neuropeptide Y receptor type 5
Ligand
BDBM50298621
Substrate
Meas. Tech.
ChEMBL_587815 (CHEMBL1043093)
IC50
2.5±n/a nM
Citation
 Sakamoto, TMoriya, MTsuge, HTakahashi, THaga, YNonoshita, KOkamoto, OTakahashi, HSakuraba, AHirohashi, TShibata, TKanno, TIto, JIwaasa, HGomori, AIshihara, AFukuroda, TKanatani, AFukami, T Novel orally active NPY Y5 receptor antagonists: Synthesis and structure-activity relationship of spiroindoline class compounds. Bioorg Med Chem 17:5015-26 (2009)  
Target
Name:
Neuropeptide Y receptor type 5
Synonyms:
NPY-Y5 NPY5-R NPY5R_HUMAN NPYY5 Neuropeptide Y receptor type 5 ( NPY Y5) | Y5 receptor
Type:
Enzyme
Mol. Mass.:
50746.64
Organism:
Homo sapiens (Human)
Description:
Q15761
Residue:
445
  
Inhibitor
Name:
BDBM50298621
Synonyms:
1-(Methylsulfonyl)-N-(quinolin-6-yl)-1,2-dihydro-1'H-spiro[indole-3,4'-piperidine]-1'-carboxamide | CHEMBL577794
Type:
Small organic molecule
Emp. Form.:
C23H24N4O3S
Mol. Mass.:
436.527
SMILES:
CS(=O)(=O)N1CC2(CCN(CC2)C(=O)Nc2ccc3ncccc3c2)c2ccccc12
: