Target
Neuropeptide Y receptor type 5
Ligand
BDBM50298633
Substrate
Meas. Tech.
ChEMBL_587815 (CHEMBL1043093)
IC50
3.2±n/a nM
Citation
 Sakamoto, TMoriya, MTsuge, HTakahashi, THaga, YNonoshita, KOkamoto, OTakahashi, HSakuraba, AHirohashi, TShibata, TKanno, TIto, JIwaasa, HGomori, AIshihara, AFukuroda, TKanatani, AFukami, T Novel orally active NPY Y5 receptor antagonists: Synthesis and structure-activity relationship of spiroindoline class compounds. Bioorg Med Chem 17:5015-26 (2009)  
Target
Name:
Neuropeptide Y receptor type 5
Synonyms:
NPY-Y5 NPY5-R NPY5R_HUMAN NPYY5 Neuropeptide Y receptor type 5 ( NPY Y5) | Y5 receptor
Type:
Enzyme
Mol. Mass.:
50746.64
Organism:
Homo sapiens (Human)
Description:
Q15761
Residue:
445
  
Inhibitor
Name:
BDBM50298633
Synonyms:
1-(Methylsulfonyl)-N-[4-(1H-pyrazol-1-yl)phenyl]-1,2-dihydro-1'H-spiro[indole-3,4'-piperidine]-1'-carboxamide | CHEMBL572456
Type:
Small organic molecule
Emp. Form.:
C23H25N5O3S
Mol. Mass.:
451.541
SMILES:
CS(=O)(=O)N1CC2(CCN(CC2)C(=O)Nc2ccc(cc2)-n2cccn2)c2ccccc12
: