Target
Acyl-CoA desaturase 1
Ligand
BDBM50298904
Substrate
Meas. Tech.
ChEMBL_588105 (CHEMBL1044831)
IC50
1.9±n/a nM
Citation
 Koltun, DOZilbershtein, TMMigulin, VAVasilevich, NIParkhill, EQGlushkov, AIMcGregor, MJBrunn, SAChu, NHao, JMollova, NLeung, KChisholm, JWZablocki, J Potent, orally bioavailable, liver-selective stearoyl-CoA desaturase (SCD) inhibitors. Bioorg Med Chem Lett 19:4070-4 (2009)  
Target
Name:
Acyl-CoA desaturase 1
Synonyms:
ACOD1_RAT Scd Stearoyl-CoA desaturase 1 (SCD1)
Type:
Enzyme
Mol. Mass.:
41485.97
Organism:
Rattus norvegicus (Rat)
Description:
P07308
Residue:
358
  
Inhibitor
Name:
BDBM50298904
Synonyms:
2-hydroxy-N-(2-(2-oxo-3-(trifluoromethyl)-7-(3-(trifluoromethyl)benzylamino)quinoxalin-1(2H)-yl)ethyl)acetamide | CHEMBL575817
Type:
Small organic molecule
Emp. Form.:
C21H18F6N4O3
Mol. Mass.:
488.383
SMILES:
OCC(=O)NCCn1c2cc(NCc3cccc(c3)C(F)(F)F)ccc2nc(c1=O)C(F)(F)F
: