Target
Acyl-CoA desaturase 1
Ligand
BDBM50298907
Substrate
Meas. Tech.
ChEMBL_588105 (CHEMBL1044831)
IC50
1.4±n/a nM
Citation
 Koltun, DOZilbershtein, TMMigulin, VAVasilevich, NIParkhill, EQGlushkov, AIMcGregor, MJBrunn, SAChu, NHao, JMollova, NLeung, KChisholm, JWZablocki, J Potent, orally bioavailable, liver-selective stearoyl-CoA desaturase (SCD) inhibitors. Bioorg Med Chem Lett 19:4070-4 (2009)  
Target
Name:
Acyl-CoA desaturase 1
Synonyms:
ACOD1_RAT Scd Stearoyl-CoA desaturase 1 (SCD1)
Type:
Enzyme
Mol. Mass.:
41485.97
Organism:
Rattus norvegicus (Rat)
Description:
P07308
Residue:
358
  
Inhibitor
Name:
BDBM50298907
Synonyms:
CHEMBL572876 | N-(2-(6-(3,4-dichlorobenzylamino)-3-oxo-2H-benzo[b][1,4]oxazin-4(3H)-yl)ethyl)-2-hydroxyacetamide
Type:
Small organic molecule
Emp. Form.:
C19H19Cl2N3O4
Mol. Mass.:
424.278
SMILES:
OCC(=O)NCCN1C(=O)COc2ccc(NCc3ccc(Cl)c(Cl)c3)cc12
: